{"text_format":"1","workbook":"xlsx","n_sheets":9,"sheets":["Instructions","Scoping Questions","Basel III Approach Values","Standardized Approach Values","Summary and Timeline","Minority Interest","Equity Investments","Data","Sheet1"],"not_rendered":{"charts":0,"images":0,"macros":1,"external_links":0,"defined_names":10,"comments":6,"pivot_tables":0},"unopened":[],"bounds":{"document_bytes":16777216,"sheet_cells":100000,"rows_first":2000,"rows_last":500,"rows_between":2000,"halvings":0,"cell_chars":16384,"cell_head_chars":4096},"cells_cut":0,"cells_raw":0,"read":"whole","date_system":"1900"}

{"sheet":"Instructions","index":0,"n_rows":38,"n_cols":2,"rows_kept":38,"cut":false,"hidden":false,"merged":[[0,0,0,3],[35,0,35,3],[36,0,36,3],[37,0,37,3],[18,0,18,3],[22,1,22,3],[24,0,24,3],[28,0,28,3],[29,0,29,1],[31,0,31,1]]}
["Instructions for Completing Notice of Proposed Rulemakings Regulatory Capital Estimation Tool*"]
[]
["Step 1","Ensure Macro Content is Enabled"]
[]
["Step 2","Input RSSD ID number on the Scoping Questions tab."]
[]
["Step 3","Answer the Yes/No questions on the Scoping Questions tab."]
[]
["Step 4","Input data in highlighted boxes on the Basel III Approach Values Tab."]
[]
["Step 5","Input data in highlighted boxes Standardized Approach Values Tab."]
[]
["Step 6","See estimation tool results and timeline detail on the Summary and Timeline tab."]
[]
["Special Cases Tabs:  Optional inputs for institutions with minority interests or equity securities.  "]
{"$rows_left_out":24}
{"sheet":"Scoping Questions","index":1,"n_rows":24,"n_cols":33,"rows_kept":24,"cut":false,"hidden":false,"merged":[[0,0,0,18],[11,11,12,17],[1,0,1,18],[8,1,8,7],[9,1,9,7],[10,1,10,7],[11,1,11,7],[12,1,12,7],[8,11,8,17],[9,11,9,17],[21,1,22,7],[17,1,17,7],[18,1,18,7],[19,1,20,7],[10,11,10,17],[13,11,13,17],[17,11,18,17],[19,11,20,17]]}
["Scoping Questions"]
["Answering the following questions may help limit the number of values that your institution will have to enter on the following tabs. Selecting 'Yes' will highlight cells in yellow that should be input by the user.*"]
[]
[null,"RSSD ID:"]
[null,null,null,null,null,null,null,null,null,null,null,null,null,null,null,null,null,null,null,null,null,null,null,null,null,null,null,null,null,null,null,"Data Copy Source"]
["Basel III",null,null,null,null,null,null,null,null,null,null,null,null,null,null,null,null,null,null,null,null,null,null,null,null,null,null,null,null,null,"Yes","Scoping questions default","Select"]
["Please indicate whether your institution has the following exposures (other than deferred tax assets, most community institutions likely do not have such exposures).",null,null,null,null,null,null,null,null,null,null,null,null,null,null,null,null,null,null,null,null,null,null,null,null,null,null,null,null,null,"No","Qualifying common + surplus",{"$f":"IF(ISERROR(VLOOKUP($C$4,data,16,FALSE)),0,(VLOOKUP($C$4,data,16,FALSE)+VLOOKUP($C$4,data,17,FALSE)))","v":0}]
[null,null,null,null,null,null,null,null,null,null,null,null,null,null,null,null,null,null,null,null,null,null,null,null,null,null,null,null,null,null,null,"Retained Earnings",{"$f":"IF(ISERROR((VLOOKUP($C$4,data,18,FALSE))),0,VLOOKUP($C$4,data,18,FALSE))","v":0}]
["1)","Qualifying minority interest - if 'Yes' see Minority Interest tab",null,null,null,null,null,null,"Select",null,"6)","Significant investments in other institutions' common stock",null,null,null,null,null,null,"Select",null,null,null,null,null,null,null,null,null,null,null,null,"AOCI",{"$f":"IF(ISERROR((VLOOKUP($C$4,data,19,FALSE))),0,VLOOKUP($C$4,data,19,FALSE))","v":0}]
["2)","Deferred tax assets (DTAs) that arise from operating loss carryforwards",null,null,null,null,null,null,"Select",null,"7)  ","Gains or losses from cash flow hedges for items not at fair value",null,null,null,null,null,null,"Select",null,null,null,null,null,null,null,null,null,null,null,null,"Goodwill",{"$f":"IF(ISERROR(VLOOKUP($C$4,data,57,FALSE)),0,(VLOOKUP($C$4,data,57,FALSE)+VLOOKUP($C$4,data,22,FALSE)+VLOOKUP($C$4,data,60,FALSE)))","v":0}]
["3)","Deferred tax assets arising from timing differences",null,null,null,null,null,null,"Select",null,"8)","Non-significant investments ",null,null,null,null,null,null,"Select",null,null,null,null,null,null,null,null,null,null,null,null,"Change in fair value",{"$f":"IF(ISERROR((VLOOKUP($C$4,data,10,FALSE))),0,VLOOKUP($C$4,data,10,FALSE))","v":0}]
["4)","Investments in your own capital instruments and reciprocal holdings",null,null,null,null,null,null,"Select",null,"9)","Significant investments in the additional tier 1 instruments or tier 2 instruments of another financial institution",null,null,null,null,null,null,"Select",null,null,null,null,null,null,null,null,null,null,null,null,"Mortgage Servicing Assets",{"$f":"IF(ISERROR(VLOOKUP($C$4,data,24,FALSE)),0,VLOOKUP($C$4,data,24,FALSE))","v":0}]
["5)","Securitization gains on sale",null,null,null,null,null,null,"Select",null,null,null,null,null,null,null,null,null,null,null,null,null,null,null,null,null,null,null,null,null,null,"Additional Tier 1",{"$f":"IF(ISERROR(VLOOKUP($C$4,data,26,FALSE)),0,(VLOOKUP($C$4,data,26,FALSE)-VLOOKUP($C$4,data,14,FALSE)))","v":0}]
[null,null,null,null,null,null,null,null,null,null,null,null,null,null,null,null,null,null,null,null,null,null,null,null,null,null,null,null,null,null,null,"Tier 2",{"$f":"IF(ISERROR(VLOOKUP($C$4,data,13,FALSE)),0,(VLOOKUP($C$4,data,13,FALSE)+VLOOKUP($C$4,data,14,FALSE)+VLOOKUP($C$4,data,54,FALSE)))","v":0}]
["Standardized",null,null,null,null,null,null,null,null,null,null,null,null,null,null,null,null,null,null,null,null,null,null,null,null,null,null,null,null,null,null,"Estimated ALLL",{"$f":"IF(ISERROR(VLOOKUP($C$4,data,51,FALSE)),0,MIN((VLOOKUP($C$4,data,51,FALSE)+VLOOKUP($C$4,data,52,FALSE)),1.25%*(VLOOKUP($C$4,data,62,FALSE)-VLOOKUP($C$4,data,61,FALSE))))","v":0}]
{"$rows_left_out":10}
{"sheet":"Basel III Approach Values","index":2,"n_rows":62,"n_cols":30,"rows_kept":62,"cut":false,"hidden":false,"merged":[[0,0,0,6],[1,5,1,6]]}
["Basel III Approach Inputs"]
[{"$f":"'Summary and Timeline'!A2","v":0},null,{"$f":"'Summary and Timeline'!B2","v":0},null,{"$f":"'Summary and Timeline'!D2","v":0},{"$f":"'Summary and Timeline'!H2","v":0},null,null,null,null,null,null,null,null,null,null,null,null,null,null,null,null,null,null,null,null,null,null,"Current","Current"]
[null,null,null,null,null,null,null,null,null,null,null,null,null,null,null,null,null,null,null,null,null,null,null,null,null,null,null,null,"Basel III","Standardized"]
["Common Equity Tier 1 (CET1) Capital","(000)","(000) ",null,"Tier 2 Capital","(000)","(000) ",null,null,null,null,null,null,null,null,null,null,null,null,null,null,null,null,null,1,{"$f":"'Scoping Questions'!$I$9","v":"Select"}]
["+ Qualifying common stock instruments and related surplus",null,0,null,"+ Tier 2 capital instruments",null,0,null,null,null,null,null,null,null,null,null,null,null,null,null,null,null,null,null,2,{"$f":"'Scoping Questions'!$I$10","v":"Select"}]
["+ Retained earnings",null,0,null,"+ Total capital minority interest that is not included in tier 1 capital",null,0,null,null,null,null,null,null,null,null,null,null,null,null,null,null,null,null,null,3,{"$f":"'Scoping Questions'!$I$11","v":"Select"}]
["+ AOCI",null,0,null,"+ Estimated ALLL includable in tier 2",null,0,null,null,null,null,null,null,null,null,null,null,null,null,null,null,null,null,null,4,{"$f":"'Scoping Questions'!$I$12","v":"Select"}]
["+ Qualifying common equity tier 1 minority interest ",null,0,null,"- Investments in institution's own tier 2 capital instruments and reciprocal holdings",null,0,null,null,null,null,null,null,null,null,null,null,null,null,null,null,null,null,null,5,{"$f":"'Scoping Questions'!$I$13","v":"Select"}]
["- Gains / Losses on Cash Flow Hedges related to items that are not fair valued ",null,0,null,"+ Non-qualifying tier 1 capital instruments includable in tier 2 ",null,0,null,null,null,null,null,null,null,null,null,null,null,null,null,null,null,null,null,6,{"$f":"'Scoping Questions'!$S$9","v":"Select"}]
["- Goodwill and other intangibles (other than MSAs)",null,0,null,"- Significant investments in tier 2 instruments",null,0,null,null,null,null,null,null,null,null,null,null,null,null,null,null,null,null,null,7,{"$f":"'Scoping Questions'!$S$10","v":"Select"}]
["- DTAs arising from operating loss and tax credit carryforwards",null,0,null,"- Non-significant investments in tier 2 instruments",0,{"$f":"C57","v":0},null,null,null,null,null,null,null,null,null,null,null,null,null,null,null,null,null,8,{"$f":"'Scoping Questions'!$S$11","v":"Select"}]
["- Change in fair value of financial liabilities",null,0,null,"    = Tier 2 Capital",null,{"$f":"MAX(0,G5+G6+G7-G8+G9-G10-G11)","v":0},null,null,null,null,null,null,null,null,null,null,null,null,null,null,null,null,null,9,{"$f":"'Scoping Questions'!$S$12","v":"Select"}]
["- Investment in institution's own CET1 capital instruments and reciprocal holdings",null,0,null,null,null,null,null,null,null,null,null,null,null,null,null,null,null,null,null,null,null,null,null,10,{"$f":"'Scoping Questions'!$S$14","v":0}]
["- Securitization gain on sale",null,0]
["- Non-significant investments in the form of common stock",0,{"$f":"C55","v":0}]
{"$rows_left_out":48}
{"sheet":"Standardized Approach Values","index":3,"n_rows":32,"n_cols":24,"rows_kept":32,"cut":false,"hidden":false,"merged":[[0,0,0,8],[4,6,4,7],[1,7,1,8],[14,1,14,2],[2,0,2,8]]}
["Standardized Approach Inputs"]
[{"$f":"'Summary and Timeline'!A2","v":0},null,null,{"$f":"'Summary and Timeline'!B2","v":0},null,{"$f":"'Summary and Timeline'!D2","v":0},null,{"$f":"'Summary and Timeline'!H2","v":0}]
["The tool estimates RWAs under the Standardized Approach by adjusting current RWAs for the categories listed below.  This sheet asks for four different types of inputs: gross exposures, current RWAs, RWAs under proposed rules, and changes in RWA. Carefully determine the input required for each cell."]
[]
["Risk-Weighted Assets"," "," 2","(000)",null,"Risk-Weighted Assets","CCF/Risk Weight",null,"(000)",null,null,null,null,null,null,null,null,null,null,null,null,null,1,{"$f":"'Scoping Questions'!$I$18","v":"Select"}]
["Current Risk-Weighted Assets ",null,null,0,null,"Column1","    Current CCF/Risk-Weight","   Proposed CCF/Risk Weight","Exposure"]
["  1-4 Family Residential Real Estate Risk-Weighted Assets",null,null,0]
["  Securitization Risk-Weighted Assets",null,null,0,null,"Credit Conversion Factors"]
[null,null,null,null,null,"Commitments with an original maturity less than 1 year that are not unconditionally cancelable",0,0.2,0]
["Securitization Risk-Weighted Assets under Proposed Rules"]
["  SSFA Method",null,null,0]
["  Gross-up Method",null,null,0]
["  1250%",null,null,0,null,"Collateralized Transactions, where collateral is:",null,null,null,null,null,null,null,null,null,null,null,null,null,null,null,null,3,{"$f":"'Scoping Questions'!$I$19","v":"Select"}]
[null,null,null,null,null,"Cash on deposit at the bank or third party custodian",{"$f":"IF(ISERROR(VLOOKUP($D$2,data,65,FALSE)),0,IF(VLOOKUP($D$2,data,65,FALSE)=\"FDIC\",20%,0%))","v":0},0,0,null,null,null,null,null,null,null,null,null,null,null,null,null,4,{"$f":"'Scoping Questions'!$I$20","v":"Select"}]
[null,"Risk Weights",null,null,null,"US Government securities (discounted by 20%)",{"$f":"IF(ISERROR(VLOOKUP($D$2,data,65,FALSE)),0,IF(VLOOKUP($D$2,data,65,FALSE)=\"FDIC\",20%,0%))","v":0},0,0,null,null,null,null,null,null,null,null,null,null,null,null,null,5,{"$f":"'Scoping Questions'!$I$22","v":"Select"}]
{"$rows_left_out":18}
{"sheet":"Summary and Timeline","index":4,"n_rows":88,"n_cols":18,"rows_kept":88,"cut":false,"hidden":false,"merged":[[0,0,0,7],[20,1,20,2],[8,5,8,6],[9,5,9,6],[10,5,10,6],[11,5,11,6]]}
["Summary and Timeline"]
[{"$f":"IF(ISERROR(VLOOKUP($B$2,data,3,FALSE)),0,VLOOKUP($B$2,data,3,FALSE))","v":0},{"$f":"'Scoping Questions'!C4","v":0},null,{"$f":"IF(ISERROR(VLOOKUP($B$2,data,4,FALSE)),0,CONCATENATE(VLOOKUP($B$2,data,4,FALSE),\", \",VLOOKUP($B$2,data,5,FALSE)))","v":0},null,null,null,{"$f":"IF(ISERROR(VLOOKUP($B$2,data,8,FALSE)),0,VLOOKUP($B$2,data,8,FALSE))","v":0}]
[null,null,null,null,null,null,null,null,null,null,null,null,null,null,null,null,null,"Select"]
["Summary Estimates for Fully Phased-in Proposals (as of 2022) - Comparisons",null,null,null,null,null,null,null,null,null,null,null,null,null,null,null,null,"Basel III Rules only"]
["Dollar Amount (000)","Current Rules","Basel III Rules Only","Basel III and Standardized",null,null,null,null,null,null,null,null,null,null,null,null,null,"Basel III and Standardized"]
["Common Equity Tier 1 Capital","n/a",{"$f":"K59","v":0},{"$f":"C6","v":0}]
["Tier 1 Capital",{"$f":"IF(ISERROR(VLOOKUP($B$2,data,12,FALSE)),0,VLOOKUP($B$2,data,12,FALSE))","v":0},{"$f":"K68","v":0},{"$f":"C7","v":0}]
["Tier 2 Capital",{"$f":"IF(ISERROR(VLOOKUP($B$2,data,33,FALSE)),0,VLOOKUP($B$2,data,33,FALSE))","v":0},{"$f":"K73","v":0},{"$f":"C8","v":0},null,"Basel III and Standardized RWA = "]
["Total Capital",{"$f":"IF(ISERROR(VLOOKUP($B$2,data,34,FALSE)),0,VLOOKUP($B$2,data,34,FALSE))","v":0},{"$f":"K75","v":0},{"$f":"C9","v":0},null,"Standardized RWA",null,{"$f":"'Standardized Approach Values'!I32","v":0}]
["Risk-Weighted Assets",{"$f":"IF(ISERROR(VLOOKUP($B$2,data,32,FALSE)),0,VLOOKUP($B$2,data,32,FALSE))","v":0},{"$f":"'Basel III Approach Values'!G43","v":0},{"$f":"C10+'Standardized Approach Values'!I30","v":0},null,"Plus Items Currently Disallowed/Neutralized",null,{"$f":"'Basel III Approach Values'!G40","v":0}]
["Average Assets",{"$f":"IF(ISERROR(VLOOKUP($B$2,data,7,FALSE)),0,VLOOKUP($B$2,data,7,FALSE))","v":0},{"$f":"IF(ISERROR(VLOOKUP($B$2,data,6,FALSE)),0,VLOOKUP($B$2,data,6,FALSE)-'Basel III Approach Values'!G41)","v":0},{"$f":"C11","v":0},null,"Less Basel III Adjustments",null,{"$f":"'Basel III Approach Values'!G41","v":0}]
[null,null,null,null,null,"Total Combined RWA",null,{"$f":"H9+H10-H11","v":0}]
["Regulatory Ratios","Current Rules","Basel III Rules Only","Basel III & Standardized"]
["Leverage Ratio",{"$f":"B$7/B$11","v":{"$error":"#DIV/0!"}},{"$f":"C$7/C$11","v":{"$error":"#DIV/0!"}},{"$f":"D$7/D$11","v":{"$error":"#DIV/0!"}}]
["Common Equity Tier 1 Capital Ratio","n/a",{"$f":"C$6/C$10","v":{"$error":"#DIV/0!"}},{"$f":"D$6/D$10","v":{"$error":"#DIV/0!"}}]
{"$rows_left_out":74}
{"sheet":"Minority Interest","index":5,"n_rows":33,"n_cols":15,"rows_kept":33,"cut":false,"hidden":false,"merged":[]}
["Will likely not need to be completed by most institutions."]
["Calculations Related to Minority Interest","Subsidiary:"," ","  ","   ","     ","Amount to be included in capital:"]
[null,1,2,3,4,5]
["Common equity tier 1 capital of the subsidiary",0,0,0,0,0,null,null,null,null,null,null,null,null,{"$f":"'Scoping Questions'!I9","v":"Select"}]
["Percentage of the subsidiary's common equity tier 1 capital not owned by banking organization",0,0,0,0,0]
["Common equity tier 1 minority interest",{"$f":"B4*B5","v":0},{"$f":"C4*C5","v":0},{"$f":"D4*D5","v":0},{"$f":"E4*E5","v":0},{"$f":"F4*F5","v":0}]
["Total risk-weighted assets (RWAs) of the subsidiary",0,0,0,0,0]
["The amount of common equity tier 1 capital the subsidiary must hold to meet a 7 percent common equity tier 1 capital ratio",{"$f":"B7*0.07","v":0},{"$f":"C7*0.07","v":0},{"$f":"D7*0.07","v":0},{"$f":"E7*0.07","v":0},{"$f":"F7*0.07","v":0}]
["\"Surplus\" common equity tier 1 capital of the subsidiary ",{"$f":"MAX(B4-B8,0)","v":0},{"$f":"MAX(C4-C8,0)","v":0},{"$f":"MAX(D4-D8,0)","v":0},{"$f":"MAX(E4-E8,0)","v":0},{"$f":"MAX(F4-F8,0)","v":0}]
["\"Surplus\" common equity tier 1 minority interest ",{"$f":"B5*B9","v":0},{"$f":"C5*C9","v":0},{"$f":"D5*D9","v":0},{"$f":"E5*E9","v":0},{"$f":"F5*F9","v":0}]
["Common equity tier 1 minority interest includable in common equity tier 1 capital",{"$f":"MAX(B6-B10,0)","v":0},{"$f":"MAX(C6-C10,0)","v":0},{"$f":"MAX(D6-D10,0)","v":0},{"$f":"MAX(E6-E10,0)","v":0},{"$f":"MAX(F6-F10,0)","v":0},{"$f":"SUM(B11:F11)","v":0},"Enter in 'Basel III Approach Values 'tab, cell C8."]
[]
["Tier 1 capital of the subsidiary",{"$f":"B14+B4","v":0},{"$f":"C14+C4","v":0},{"$f":"D14+D4","v":0},{"$f":"E14+E4","v":0},{"$f":"F14+F4","v":0}]
["Additional tier 1 capital of the subsidiary",0,0,0,0,0]
["Additional tier 1 capital of the subsidiary not owned by the banking organization",0,0,0,0,0]
{"$rows_left_out":19}
{"sheet":"Equity Investments","index":6,"n_rows":21,"n_cols":9,"rows_kept":21,"cut":false,"hidden":false,"merged":[[0,0,0,2]]}
["Equity Exposures"]
["Enter exposure amounts at carrying value",null,null,null,null,null,null,null,"Yes"]
["Equity Exposures ","Exposure","Change in Risk-Weighted Assets",null,null,null,null,{"$f":"'Scoping Questions'!I22","v":"Select"}]
["Equity exposures in unconsolidated SBICs and equity exposures held by consolidated SBICs",0,{"$f":"IF((($B$4+$B$5+$B$6)>(0.1*$C$17))*AND($B$4>(0.1*$C$17)),(($B$4-(0.1*$C$17))*3),0)","v":0}]
["Publicly traded equity exposures",0,{"$f":"IF((($B$4+$B$5+$B$6)>(0.1*$C$17))*AND(($B$4+$B$5)>(0.1*$C$17)),MIN(((($B$4+$B$5)-(0.1*$C$17))*2),($B$5*2)),0)","v":0}]
["Non-publicly traded equity exposures",0,{"$f":"IF((($B$4+$B$5+$B$6)>(0.1*$C$17))*AND(($B$4+$B$5+$B$6)>(0.1*$C$17)),MIN(((($B$4+$B$5+$B$6)-(0.1*$C$17))*3),($B$6*3)),0)","v":0}]
["600% Risk Weight exposures",0,{"$f":"$B$7*5","v":0}]
[]
["Equity Exposures to Investment Funds","Current Risk-Weighted Assets","Proposed Risk-Weighted Assets"]
["Full Look-Through Approach",0,0]
["Simple Modified Look-Through Approach",0,0]
["Alternative Modified Look-Through Approach",0,0]
[]
["Change in RWA for Equity Exposures Under Standardized Approach:",null,{"$f":"$C$4+$C$5+$C$6+$C$7-SUM(B10:B12)+SUM(C10:C12)","v":0},"Enter into 'Standardized Approach Values' tab, cell D32"]
[]
{"$rows_left_out":7}
{"sheet":"Data","index":7,"n_rows":1350,"n_cols":72,"rows_kept":1350,"cut":false,"hidden":true,"merged":[]}
[null,null,null,null,null,"HC-K  5.","HC-R 27.","HC 12.","HC-R 7a.","HC-R 7b.","HC-R 4.","HC-R 11.","HC-R 12.","HC-R 13.","HC-R 14.","HC 24.","HC 25.","HC 26a","HC 26b","HC 26c","HC-R 10","HC-M 12b","HC-F 2.","HC-M 12a","HC-R 9a","HC 23.","HC-R 6a.","HC-R 5.","HC-R 31.","HC-R 32.","HC-R 33.","HC-R 62.","HC-R 17","HC-R 21.","HC-N 11 col B","HC-N 11 col C","HC-N 10 col B","HC-N 10 col C","HC-N 12f. col B","HC-N 12f. col C","HC-N 11b col B","HC-N 11b col C","HC-N 1c.2a col B","HC-N 1c. 2b col B","HC-N 1c.2a col C","HC-N 1c.2b col C","HC-N 1c1. col B","HC-N 1c1. col C","HC 8","HC-R 61.","HC 4c.","HC-G 3.","HC 27b.","HC-R 16.","HC-M 12a1.","HC-R 60.","HC 10a.","HC-R 9b.","HC-R 15","HC-M 12c","HC-R 58","HC-R 59","HC-R 2","HC-R 3","HC-R 6b.","HC-R 6c.","HC-R memo 3a","HC-R memo 3b","HC-R memo 3d","HC-R memo 5b","HC-R memo 8d","HC-R memo 8c"]
[1,2,3,4,5,6,7,{"$f":"G2+1","v":8},{"$f":"H2+1","v":9},10,11,12,13,14,15,16,17,18,19,20,21,22,23,24,25,26,27,28,29,30,31,32,33,34,35,36,37,38,39,40,41,42,43,44,45,46,47,48,49,50,51,52,53,54,55,56,57,58,59,60,61,62,63,64,65,66,67,68,69,70,71,72]
["ID_RSSD","D_DT","NAME","CITY","STATE","BHCK3368","BHCKA224","BHCK2170","BHCKB590","BHCKF264","BHCK4336","BHCK8274","BHCKG217","BHCKG218","BHCK5310","BHCK3230","BHCK3240","BHCK3247","BHCKB530","BHCKA130","BHCKB592","BHCKB026","BHCK2148","BHCK3164","BHCKB591","BHCK3283","BHCKG214","BHCKB588","BHCK7204","BHCK7206","BHCK7205","BHCKA223","BHCK5311","BHCK3792","BHCKK037","BHCKK038","BHCK5525","BHCK5526","BHCKK103","BHCKK104","BHCKK043","BHCKK044","BHCKC237","BHCKC239","BHCKC229","BHCKC230","BHCK5399","BHCK5400","BHCK2130","BHCK3128","BHCK3123","BHCKB557","BHCK3000","BHCKB594","BHCK6438","BHCKA222","BHCK3163","BHCT5610","BHCK2221","BHCK5507","BHCK1651","BHCKB704","BHCK8434","BHCKA221","BHCKG215","BHCKG216","BHCK5479","BHCKC498","BHCKA507","BHCK5484","BHCKC502","BHCK5990"]
[1020180,20120630,"BREMER FNCL CORP              ","SAINT PAUL","MN",8040205,7994849,8060342,72075,0,-30036,819402,0,0,76326,2847,0,828631,-6165,0,0,0,29180,0,0,0,0,0,10.25,13.45,14.71,6090877,76326,895728,67,11175,778,52972,0,0,0,0,0,0,8657,4351,0,3548,1898,0,85515,6049,0,0,0,15238,84226,0,0,175,0,6106115,23872,0,60000,0,0,0,0,0,60000,0]
[1020667,20120630,"NORTHWEST INV CORP            ","DAVENPORT","IA",null,null,19601]
[1020676,20120630,"AMALGAMATED INV CO            ","CHICAGO","IL",826058,822197,974562,85,0,-5255,49005,0,0,5146,2,0,42864,-4513,0,0,0,8949,0,0,0,0,0,5.96,12.01,13.27,408042,5146,54151,0,0,909,24518,0,0,0,0,0,0,705,0,0,0,310,0,10225,0,0,0,0,5079,0,3776,0,86,0,413121,742,0,10000,0,0,0,0,0,10000,0]
[1020902,20120630,"FIRST NAT OF NE               ","OMAHA","NE",14976721,14809244,15199948,165498,0,-87350,1529656,180000,0,148722,1575,2365,1542994,-72552,0,0,39270,169780,19789,1979,0,199,0,10.33,13.03,15.84,11736733,329017,1858673,427,1536,2792,173590,0,0,0,0,644,49,17429,2450,92,1272,808,0,288927,19502,199,0,19789,159707,166188,0,295,2743,0,11896440,14798,0,150000,0,0,0,0,0,150000,0]
[1021682,20120630,"CITIZENS BSHRS                ","FARMINGTON","NM",682050,682050,687960,0,0,0,60847,0,0,3445,890,8278,60591,4980,-9752,0,0,0,0,0,0,0,0,8.92,21.53,22.75,282570,3445,64292,0,0,28,682,0,0,0,0,0,0,137,0,0,0,0,0,3103,342,0,0,0,0,0,0,0,0,0,282570,4980,4160,5000,0,0,0,0,9752,5000,0]
[1022764,20120630,"CENTRAL PACIFIC FC            ","HONOLULU","HI",4139304,4127327,4227070,10015,0,-21601,582879,0,0,32568,784512,67933,-372558,626,0,0,0,0,22985,1962,0,0,0,14.12,23.04,24.32,2530232,32577,615456,0,0,505,120949,0,0,0,0,156,0,39719,0,0,2327,3671,0,103814,3992,9969,0,23359,75238,0,0,9,16715,0,2605470,22227,0,114969,0,0,9969,0,0,105000,0]
[1023154,20120630,"NEW MEXICO BANQUEST CORP      ","SANTA FE","NM",747615,745196,759004,2419,0,-14,79627,87,0,6194,517,25520,42506,2022,-11,0,0,0,0,0,0,0,0,10.69,16.149999999999999,17.420000000000002,493151,6281,85908,0,0,0,5076,0,0,0,0,0,0,85,29,0,0,705,0,8427,106,57,0,0,2339,1287,0,0,1132,0,495490,2022,0,13500,0,0,0,0,11,13500,0]
[1023239,20120630,"MERCHANTS BSHRS               ","SOUTH BURLINGTON","VT",1636196,1636196,1601769,0,0,-3408,130840,0,0,11211,67,36649,89600,3248,-15476,0,0,4734,0,0,0,0,0,8,14.61,15.86,895512,11211,142051,0,0,0,2704,0,0,0,0,0,0,1279,52,0,904,619,0,11203,614,0,0,0,606,0,0,0,0,0,896118,6656,0,20000,0,0,0,0,15476,20000,0]
[1025309,20120630,"BANK OF HI CORP               ","HONOLULU","HI",13793545,13809211,13938403,31517,-198,2717,907599,0,0,70002,571,511729,1044588,32502,-585565,0,0,0,23254,2325,0,0,0,6.57,16.41,17.670000000000002,5532286,70002,977601,0,58,7168,38925,0,0,0,0,3616,178,24646,264,2114,2160,40864,0,132443,5419,0,0,23254,67860,31517,0,0,58,0,5600146,59865,0,0,0,0,0,0,585565,0,0]
[1025541,20120630,"WESTAMERICA BC                ","SAN RAFAEL","CA",4974619,4837294,4950068,137325,0,-197,407571,0,0,34216,260039,115693,169164,13030,0,0,0,43423,2,0,0,0,0,8.43,14.46,15.74,2818628,36079,443650,0,0,665,46454,112,8029,0,0,0,0,1603,3085,0,301,0,0,31523,2693,0,0,2,0,121673,0,1863,25888,0,2818628,13227,0,0,0,0,0,0,0,0,0]
[1025608,20120630,"BANCWEST CORP                 ","HONOLULU","HI",78188475,73048394,78655826,5269876,0,-137805,5934096,0,0,737132,1395,7235271,3856317,13220,0,0,0,523505,35208,0,0,0,0,8.1199999999999992,10.1,11.37,58765209,746814,6680910,1690,13611,21448,697177,0,0,0,0,5872,0,139056,3382,696,10534,0,0,917158,25325,17140,0,39757,205351,5197006,0,9682,72870,0,58970560,151026,0,110990,0,0,0,0,0,100000,0]
[1025662,20120630,"CENTRAL BC                    ","PROVO","UT",676584,675833,688725,751,0,0,104311,0,0,6143,254,0,104808,2673,0,0,0,5169,0,0,0,0,0,15.43,21.49,22.75,485475,6143,110454,0,26,2572,5026,0,0,0,0,11,25,663,232,19,0,0,0,12089,0,0,0,0,5946,751,0,0,0,0,491421,2673,0,0,0,0,0,0,0,0,0]
{"$rows_left_out":1336}
{"sheet":"Sheet1","index":8,"n_rows":0,"n_cols":0,"rows_kept":0,"cut":false,"hidden":false,"merged":[]}